{"text_format":"1","workbook":"xlsx","n_sheets":10,"sheets":["Innehåll","Contents","Vägledning","Guide","Anvisningar","Data","Diagram 1","Graph 1","Diagram 2","Graph 2"],"not_rendered":{"charts":4,"images":9,"macros":1,"external_links":0,"defined_names":46,"comments":1,"pivot_tables":0},"unopened":[],"bounds":{"document_bytes":16777216,"sheet_cells":100000,"rows_first":2000,"rows_last":500,"rows_between":2000,"halvings":0,"cell_chars":16384,"cell_head_chars":4096},"cells_cut":0,"cells_raw":0,"read":"whole","date_system":"1900"}

{"sheet":"Innehåll","index":0,"n_rows":12,"n_cols":3,"rows_kept":12,"cut":false,"hidden":false,"merged":[]}
[]
[null,"Innehållsförteckning: Inflation 1831–"]
[]
[null,"Anvisningar","Anvisningar för att producera diagram till webben"]
[]
[null,"Vägledning","Utskriftstips"]
[]
[null,"Data","Tidsserier som ligger till grund för diagrammen samt originalserie"]
[]
[null,"Diagram 1","Årlig förändring i procent av konsumentpriserna"]
[]
[null,"Diagram 2","Index juli 1914=100. Logaritmisk skala"]

{"sheet":"Contents","index":1,"n_rows":10,"n_cols":3,"rows_kept":10,"cut":false,"hidden":false,"merged":[]}
[]
[null,"Contents: Inflation 1831–"]
[]
[null,"Guide","Printing tips"]
[]
[null,"Data","Time series"]
[]
[null,"Graph 1","Annual per cent change of consumer prices"]
[]
[null,"Graph 2","Index July 1914=100. Logarithmic scale"]

{"sheet":"Vägledning","index":2,"n_rows":6,"n_cols":3,"rows_kept":6,"cut":false,"hidden":false,"merged":[]}
[]
[null,"Vägledning"]
[]
[null,"Utskriftstips","Utskriftsformatet i samtliga flikar med diagram är förinställt på att utskriften förstoras till 120% och innehållet centreras vertikalt och horisontellt."]
[null,null,"Om utskriften av diagrammen inte blir tillfredställande så ändra inställningarna under utskriftsformat till vad som passar just din skrivare."]
[null,null,"Du kan också i diagrammet, om det är nödvändigt, ändra t.ex färg på en kurva, formateringen av stödlinjer etc."]

{"sheet":"Guide","index":3,"n_rows":6,"n_cols":3,"rows_kept":6,"cut":false,"hidden":false,"merged":[]}
[]
[null,"Guide"]
[]
[null,"Printing tips","Default settings for page setup of all tabs with diagrams enlarge print to 120%, and contents are centred vertically and horizontally."]
[null,null,"If printing of the diagram is not satisfactory, you can change settings under page setup to suit your printer."]
[null,null,"If needed, you may also change other features, such as colour of curve, formatting of gridlines, etc."]

{"sheet":"Anvisningar","index":4,"n_rows":70,"n_cols":15,"rows_kept":70,"cut":false,"hidden":true,"merged":[[57,10,57,14],[44,8,44,11]]}
[]
[]
[]
[]
[null,null,null,null,null,null,null,"Diagramuppgifter",null,{"$f":"IF(OR(yy=\"\"),\"\",\"Data t.o.m \" & \" \" & yy)","v":"Data t.o.m  2023"}]
[null,null,null,null,null,null,null,null,null,{"$f":"IF(OR(yy=\"\"),\"\",\"Data up to and including \" &  \" \" & yy)","v":"Data up to and including  2023"}]
[]
[null,null,null,null,null,null,null,"pong  (YYYYXnn)"]
[]
[null,null,null,null,null,null,null,"produktkod"]
[]
[null,null,null,null,null,null,null,"aktuell period för data:  år",null,2023]
[null,null,null,null,null,null,null,null,"månad nr",12]
[]
[null,null,null,null,null,null,null,"skapa alltid Excelfil",null,null,"beskrivning *)",null,null,"filnamn i klartext"]
[null,null,null,null,null,null,null,null,null,null,null,null,null,"sv",{"$f":"IF(I55=FALSE,\"\",IF(TRIM(I51)=\"\",\"\",I51&\"DI_06-07_SV\"&IF(TRIM(I53)<>\"\",\"_\"&TRIM(I53),\"\")))","v":"PR0101_2023A01_DI_06-07_SV"}]
[null,null,null,null,null,null,null,null,null,null,null,null,null,"eng",{"$f":"IF(I55=FALSE,\"\",IF(TRIM(I51)=\"\",\"\",I51&\"DI_06-07_EN\"&IF(TRIM(I53)<>\"\",\"_\"&TRIM(I53),\"\")))","v":"PR0101_2023A01_DI_06-07_EN"}]
[]
[null,null,null,null,null,null,null,"ange diagram-nummer och beskrivning för diagram på följande flikar:"]
[]
[null,null,null,null,null,null,null,"flik-namn",null,"nr (nn)","beskrivning (15 tkn) *)",null,null,"diagram-namn i klartext"]
[]
[null,null,null,null,null,null,null,"Diagram 1/ Graph 1",null,null,null,null,null,"sv",{"$f":"IF(TRIM(L47)=\"\",\"\",\"DI_\"&IF(LEN(TRIM(L47))<2,\"0\"&TRIM(L47),TRIM(L47))&\"_SV\" & IF(TRIM(L48)<>\"\",\"_\"&TRIM(L48),\"\"))","v":"DI_06_SV"}]
[null,null,null,null,null,null,null,null,null,null,null,null,null,"eng",{"$f":"IF(TRIM(L47)=\"\",\"\",\"DI_\"&IF(LEN(TRIM(L47))<2,\"0\"&TRIM(L47),TRIM(L47))&\"_EN\" & IF(TRIM(L48)<>\"\",\"_\"&TRIM(L48),\"\"))","v":"DI_06_EN"}]
[]
[null,null,null,null,null,null,null,"Diagram 2 / Graph 2",null,null,null,null,null,"sv",{"$f":"IF(TRIM(L49)=\"\",\"\",\"DI_\"&IF(LEN(TRIM(L49))<2,\"0\"&TRIM(L49),TRIM(L49))&\"_SV\" & IF(TRIM(L50)<>\"\",\"_\"&TRIM(L50),\"\"))","v":"DI_07_SV"}]
[null,null,null,null,null,null,null,null,null,null,null,null,null,"eng",{"$f":"IF(TRIM(L49)=\"\",\"\",\"DI_\"&IF(LEN(TRIM(L49))<2,\"0\"&TRIM(L49),TRIM(L49))&\"_EN\" & IF(TRIM(L50)<>\"\",\"_\"&TRIM(L50),\"\"))","v":"DI_07_EN"}]
[]
[null,null,null,null,null,null,null,"Diagram 3 / Graph 3",null,null,null,null,null,"sv",{"$f":"IF(TRIM(L51)=\"\",\"\",\"DI_\"&IF(LEN(TRIM(L51))<2,\"0\"&TRIM(L51),TRIM(L51))&\"_SV\" & IF(TRIM(L52)<>\"\",\"_\"&TRIM(L52),\"\"))","v":""}]
[null,null,null,null,null,null,null,null,null,null,null,null,null,"eng",{"$f":"IF(TRIM(L51)=\"\",\"\",\"DI_\"&IF(LEN(TRIM(L51))<2,\"0\"&TRIM(L51),TRIM(L51))&\"_EN\" & IF(TRIM(L52)<>\"\",\"_\"&TRIM(L52),\"\"))","v":""}]
[]
[null,null,null,null,null,null,null,"Diagram 4 / Graph 4",null,null,null,null,null,"sv",{"$f":"IF(TRIM(L53)=\"\",\"\",\"DI_\"&IF(LEN(TRIM(L53))<2,\"0\"&TRIM(L53),TRIM(L53))&\"_SV\" & IF(TRIM(L54)<>\"\",\"_\"&TRIM(L54),\"\"))","v":""}]
[null,null,null,null,null,null,null,null,null,null,null,null,null,"eng",{"$f":"IF(TRIM(L53)=\"\",\"\",\"DI_\"&IF(LEN(TRIM(L53))<2,\"0\"&TRIM(L53),TRIM(L53))&\"_EN\" & IF(TRIM(L54)<>\"\",\"_\"&TRIM(L54),\"\"))","v":""}]
[]
[null,null,null,null,null,null,null,"Diagram 5 / Graph 5",null,null,null,null,null,"sv",{"$f":"IF(TRIM(L55)=\"\",\"\",\"DI_\"&IF(LEN(TRIM(L55))<2,\"0\"&TRIM(L55),TRIM(L55))&\"_SV\" & IF(TRIM(L56)<>\"\",\"_\"&TRIM(L56),\"\"))","v":""}]
[null,null,null,null,null,null,null,null,null,null,null,null,null,"eng",{"$f":"IF(TRIM(L55)=\"\",\"\",\"DI_\"&IF(LEN(TRIM(L55))<2,\"0\"&TRIM(L55),TRIM(L55))&\"_EN\" & IF(TRIM(L56)<>\"\",\"_\"&TRIM(L56),\"\"))","v":""}]
[]
[null,null,null,null,null,null,null,"filerna sparas här:",null,"\\\\wp\\xmlDump"]
[]
[null,null,null,null,null,null,null,"*) frivillig uppgift"]
[]
[]
[]
[]
[null,null,null,null,null,null,null,null,"Mellanlagring av värden"]
[null,null,null,null,null,null,null,null,"pong",null,"diagramidentitet"]
[null,null,null,null,null,null,null,null,"2023A01",null,"nr:","6"]
[null,null,null,null,null,null,null,null,"produktkod",null,"beskrivning:",""]
[null,null,null,null,null,null,null,null,"PR0101",null,"nr:","7"]
[null,null,null,null,null,null,null,null,"Pong+prodkod",null,"beskrivning:",""]
[null,null,null,null,null,null,null,null,{"$f":"IF(OR(TRIM(I47)=\"\",TRIM(I49)=\"\"),\"\",I49&\"_\"&I47&\"_\")","v":"PR0101_2023A01_"},null,"nr:",""]
[null,null,null,null,null,null,null,null,"Beskrivn Excelfil",null,"beskrivning:",""]
[null,null,null,null,null,null,null,null,"",null,"nr:",""]
[null,null,null,null,null,null,null,null,"Skapa Excelfil",null,"beskrivning:",""]
[null,null,null,null,null,null,null,null,true,null,"nr:",""]
[null,null,null,null,null,null,null,null,null,null,"beskrivning:",""]
[]
[null,null,null,null,null,null,null,null,null,null,"Hjälplista"]
[null,null,null,null,null,null,null,null,null,null,1,"januari","January","första","First"]
[null,null,null,null,null,null,null,null,null,null,2,"februari","February","andra","Second"]
[null,null,null,null,null,null,null,null,null,null,3,"mars","March","tredje","Third"]
[null,null,null,null,null,null,null,null,null,null,4,"april","April","fjärde","Fourth"]
[null,null,null,null,null,null,null,null,null,null,5,"maj","May"]
[null,null,null,null,null,null,null,null,null,null,6,"juni","June"]
[null,null,null,null,null,null,null,null,null,null,7,"juli","July"]
[null,null,null,null,null,null,null,null,null,null,8,"augusti","August"]
[null,null,null,null,null,null,null,null,null,null,9,"september","September"]
[null,null,null,null,null,null,null,null,null,null,10,"oktober","October"]
[null,null,null,null,null,null,null,null,null,null,11,"november","November"]
[null,null,null,null,null,null,null,null,null,null,12,"december","December"]

{"sheet":"Data","index":5,"n_rows":202,"n_cols":5,"rows_kept":202,"cut":false,"hidden":false,"merged":[]}
["Inflation and price level in Sweden"]
[null,null,null,null,{"$f":"[0]!timePeriodEng","v":"Data up to and including  2023"}]
[]
["Year","Inflation","Price level"]
["Inflation och prisnivå i Sverige"]
[null,null,null,null,{"$f":"[0]!timeperiodSv","v":"Data t.o.m  2023"}]
[]
["År","Inflation","Prisnivå"]
[1830,null,62.8]
[1831,{"$f":"ROUND((C10/C9-1)*100,1)","v":4.0999999999999996},65.400000000000006]
[1832,{"$f":"ROUND((C11/C10-1)*100,1)","v":-0.3},65.2]
[1833,-1.8,64]
[1834,1.4,64.900000000000006]
[1835,1.5,65.900000000000006]
[1836,-0.9,65.3]
[1837,2.8,67.099999999999994]
[1838,5.4,70.7]
[1839,-1.6,69.599999999999994]
[1840,-2,68.2]
[1841,1.5,69.2]
[1842,1.3,70.099999999999994]
[1843,-4.7,66.8]
[1844,-6.7,62.3]
[1845,4.3,65]
[1846,4.5999999999999996,68]
[1847,2.1,69.400000000000006]
[1848,-2.7,67.5]
[1849,-1.2,66.7]
[1850,-0.3,66.5]
[1851,2,67.8]
[1852,3.2,70]
[1853,3.1,72.2]
[1854,6.9,77.2]
[1855,7.3,82.8]
[1856,10.3,91.3]
[1857,0.2,91.5]
[1858,-10.5,81.900000000000006]
[1859,-5.9,77.099999999999994]
[1860,4.5,80.599999999999994]
[1861,4.0999999999999996,83.9]
[1862,2.7,86.2]
[1863,-5,81.900000000000006]
[1864,-4.3,78.400000000000006]
[1865,-0.1,78.3]
[1866,3.2,80.8]
[1867,6.3,85.9]
[1868,3.4,88.8]
[1869,-5.7,83.7]
[1870,-4.2,80.2]
[1871,2.6,82.3]
[1872,4,85.6]
[1873,7.9,92.4]
[1874,3.6,95.7]
[1875,-0.6,95.1]
[1876,0.3,95.4]
[1877,-0.5,94.9]
[1878,-6.5,88.7]
[1879,-6.2,83.2]
[1880,5.2,87.5]
[1881,2.5,89.7]
[1882,-2.7,87.3]
[1883,-0.6,86.8]
[1884,-3.7,83.6]
[1885,-4.7,79.7]
[1886,-4.9000000000000004,75.8]
[1887,-3.6,73.099999999999994]
[1888,3.6,75.7]
[1889,4.5,79.099999999999994]
[1890,2.1,80.8]
[1891,3.1,83.3]
[1892,-1.8,81.8]
[1893,-4,78.5]
[1894,-5.0999999999999996,74.5]
[1895,1.9,75.900000000000006]
[1896,{"$f":"ROUND((C75/C74-1)*100,1)","v":-0.8},75.3]
[1897,3.2,77.7]
[1898,4.8,81.400000000000006]
[1899,4.4000000000000004,85]
[1900,1.2,86]
[1901,-2.4,83.9]
[1902,0.8,84.6]
[1903,1.7,86]
[1904,-1.2,85]
[1905,2.1,86.8]
[1906,2.1,88.6]
[1907,5.2,93.2]
[1908,1.5,94.6]
[1909,-1,93.7]
[1910,0,93.7]
[1911,3,96.5]
[1912,2.1,98.5]
[1913,0.3,98.8]
[1914,1.2,100]
[1915,15,115]
[1916,13,130]
[1917,26.2,164]
[1918,47,241]
[1919,10.4,266]
[1920,1.9,271]
[1921,-18.5,221]
[1922,-16.7,184]
[1923,-5.4,174]
[1924,0,174]
[1925,1.7,177]
[1926,-3.4,171]
[1927,-1.2,169]
[1928,1.2,171]
[1929,-1.8,168]
[1930,-3.6,162]
[1931,-3.1,157]
[1932,-1.3,155]
[1933,-2.6,151]
[1934,0.7,152]
[1935,2,155]
[1936,1.3,157]
[1937,3.2,162]
[1938,1.9,165]
[1939,3,170]
[1940,13.5,193]
[1941,13.5,219]
[1942,6.8,234]
[1943,0.4,235]
[1944,-0.4,234]
[1945,-0.4,233]
[1946,0.4,234]
[1947,3,241]
[1948,5.8,255]
[1949,0.4,256]
[1950,1.6,260]
["1951",16.899999999999999,304]
["1952",7.2,326]
["1953",0.6,328]
["1954",0.6,330]
["1955",2.7,339]
["1956",5,356]
["1957",4.5,372]
["1958",4.3,388]
["1959",0.8,391]
["1960",{"$f":"ROUND((C139/C138-1)*100,1)","v":4.0999999999999996},407]
["1961",2.2000000000000002,416]
["1962",4.8,436]
["1963",3,449]
["1964",3.1,463]
["1965",5.2,487]
["1966",6.6,519]
["1967",4,540]
["1968",2,551]
["1969",2.7,566]
["1970",6.9,605]
["1971",7.4,650]
["1972",6,689]
["1973",6.7,735]
["1974",9.9,808]
["1975",9.8000000000000007,887]
["1976",10.4,979]
["1977",11.3,1090]
["1978",10.1,1200]
["1979",7.2,1286]
["1980",13.6,1461]
[1981,12.1,1638]
[1982,8.5,1778]
[1983,8.9,1937]
[1984,8,2092]
[1985,7.4,2246]
[1986,4.2,2341]
[1987,4.2,2440]
[1988,5.8,2582]
[1989,6.4,2748]
[1990,10.5,3036]
[1991,9.3000000000000007,3319]
[1992,2.2999999999999998,3395]
[1993,4.7,3553]
[1994,2.2000000000000002,3631]
[1995,2.5,3723]
[1996,0.5,3740]
[1997,0.5,3760]
[1998,-0.2,3754]
[1999,0.5,3772]
[2000,1,3809]
[2001,2.4,3902]
[2002,2.2000000000000002,3986]
[2003,1.9,4063]
[2004,0.4,4078]
[2005,0.5,4097]
[2006,1.3,4152]
[2007,2.2000000000000002,4244]
[2008,3.4,4390]
[2009,-0.3,4378]
[2010,1.3,4434]
[2011,2.6,4550]
[2012,0.9,4590]
[2013,0,4588]
[2014,-0.2,4580]
[2015,0,4578]
[2016,1,4623]
[2017,1.8,4706]
[2018,2,4798]
[2019,1.8,4884]
[2020,{"$f":"ROUND((C199/C198-1)*100,1)","v":0.5},4908]
[2021,{"$f":"ROUND((C200/C199-1)*100,1)","v":2.2000000000000002},5014]
[2022,8.4,5434]
[2023,8.5,5898]

{"sheet":"Diagram 1","index":6,"n_rows":2,"n_cols":2,"rows_kept":2,"cut":false,"hidden":false,"merged":[]}
[null,"Inflation i Sverige 1831–2023"]
[null,"Årlig förändring i procent av konsumentpriserna "]

{"sheet":"Graph 1","index":7,"n_rows":2,"n_cols":2,"rows_kept":2,"cut":false,"hidden":false,"merged":[]}
[null,"Inflation in Sweden 1831–2023"]
[null,"Annual per cent change of consumer prices"]

{"sheet":"Diagram 2","index":8,"n_rows":2,"n_cols":2,"rows_kept":2,"cut":false,"hidden":false,"merged":[]}
[null,"Prisnivå 1830–2023"]
[null,"Index juli 1914=100. Logaritmisk skala"]

{"sheet":"Graph 2","index":9,"n_rows":2,"n_cols":2,"rows_kept":2,"cut":false,"hidden":false,"merged":[]}
[null,"Price level 1830–2023"]
[null,"Index July 1914=100. Logarithmic scale"]